{"text_format":"1","workbook":"xlsx","n_sheets":3,"sheets":["Sheet1","Sheet2","Sheet3"],"not_rendered":{"charts":0,"images":0,"macros":0,"external_links":0,"defined_names":0,"comments":0,"pivot_tables":0},"unopened":[],"bounds":{"document_bytes":16777216,"sheet_cells":100000,"rows_first":2000,"rows_last":500,"rows_between":2000,"halvings":0,"cell_chars":16384,"cell_head_chars":4096},"cells_cut":0,"cells_raw":0,"read":"whole","date_system":"1900"}

{"sheet":"Sheet1","index":0,"n_rows":160,"n_cols":23,"rows_kept":160,"cut":false,"hidden":false,"merged":[]}
[null,"Exer. 9 - Simulação  Automática"]
[null,null,null,null,"Min","Max"]
[null,null,"Tempo Vida",null,2,5]
[null,null,"Nº Acidentes/mês ",null,{"$f":"1/12","v":8.3333333333333329E-2},null,"Período Revisão (meses)",null,null,null,3]
[null,null,"Custo Peça",null,100,null,"Intervalo mínimo Subst. Peça",null,null,null,1.5]
[null,null,"Custo/Inspecção/Ver",null,1000,null,"Nº de Runs",null,null,null,150]
[null,null,"Custo/paragem",null,2000,null,null,null,null,null,null,null,null,null,null,null,null,null,null,null,"Custos Mensais"]
[null,null,null,null,null,null,null,null,null,null,null,null,null,null,null,null,null,null,null,"Peças","Revisões","Paragens","Totais"]
[null,"Tempo","Tipo","Subst. ","Prox. Inter. acidentes",null,"Prox","Bom Func. Peça",null,"Prox.","Próx.","Próximo","Tipo","Nº","Nº ","Nº ","Nº ",null,"D.Pad.",{"$f":"STDEV(T11:T160)","v":5.0785165110145263},{"$f":"STDEV(U11:U160)","v":15.029862290957258},{"$f":"STDEV(V11:V160)","v":137.17220949546717},{"$f":"STDEV(W11:W160)","v":136.43841342432773}]
[null,null,"Acontec.","Peça?","NPA","Meses","Acidente","NPA","Meses","Avaria","Revisão","Acontec.","Acontec.","Peças","Revis.","Ava.","Ac.",null,"Média",{"$f":"AVERAGE(T11:T160)","v":42.745075878177069},{"$f":"AVERAGE(U11:U160)","v":322.72127087509028},{"$f":"AVERAGE(V11:V160)","v":485.87412696281893},{"$f":"AVERAGE(W11:W160)","v":851.34047371608608}]
[null,0,"Acidente","Sim",{"$f":"IF(C11=\"Acidente\", RAND(),\"\")","v":0.71950160153434428},{"$f":"IF(E11=\"\",\"\",-1/$E$4*LN(E11))","v":3.9503583210980722},{"$f":"+F11","v":3.9503583210980722},{"$f":"RAND()","v":0.18376372415536901},{"$f":"IF(H11=\"\",0,$E$3+H11*($F$3-$E$3))","v":2.5512911724661071},{"$f":"+I11","v":2.5512911724661071},{"$f":"+$K$4","v":3},{"$f":"MIN(G11,J11,K11)","v":2.5512911724661071},{"$f":"IF(G11<K11,\"Acidente\",IF(I11<K11,\"Avaria\",\"Revisão\"))","v":"Avaria"},{"$f":"IF(D11=\"Sim\",1,0)","v":1},{"$f":"IF(C11=\"Revisão\",1,0)","v":0},{"$f":"IF(C11=\"Avaria\",1,0)","v":0},{"$f":"IF(C11=\"Acidente\",1,0)","v":1},null,null,{"$f":"+F28","v":43.333333333333336},{"$f":"+F29","v":333.33333333333331},{"$f":"+F30","v":400},{"$f":"+F31","v":776.66666666666663}]
[null,{"$f":"+L11","v":2.5512911724661071},"Avaria",{"$f":"IF(C12=\"Acidente\",\"Sim\",IF(C12=\"Avaria\",\"Sim\",IF(C12=\"Revisão\",IF((B12-B11)>$K$5,\"Sim\",\"Não\"))))","v":"Sim"},"","",{"$f":"IF(F12=\"\",G11,+G11+F12)","v":3.9503583210980722},{"$f":"IF(D12=\"Sim\",RAND(),IF(J11>L11,\"\",RAND()))","v":0.57272554529158304},{"$f":"IF(H12=\"\",0,$E$3+H12*($F$3-$E$3))","v":3.718176635874749},{"$f":"IF(D12=\"Sim\",B12+I12,IF(J11>K11,J11,B12+I12))","v":6.2694678083408562},{"$f":"IF(B12<K11,K11,K11+$K$4)","v":3},3,{"$f":"IF(G12<=L12,\"Acidente\",IF(J12<K12,\"Avaria\",\"Revisão\"))","v":"Revisão"},{"$f":"IF(D12=\"Sim\",1,0)","v":1},{"$f":"IF(C12=\"Revisão\",1,0)","v":0},{"$f":"IF(C12=\"Avaria\",1,0)","v":1},{"$f":"IF(C12=\"Acidente\",1,0)","v":0},null,1,39.393939393939391,333.33333333333331,303.030303030303,675.75757575757575]
[null,3,"Revisão",{"$f":"IF(C13=\"Acidente\",\"Sim\",IF(C13=\"Avaria\",\"Sim\",IF(C13=\"Revisão\",IF((B13-B12)>$K$5,\"Sim\",\"Não\"))))","v":"Não"},"","",3.9503583210980722,{"$f":"IF(D13=\"Sim\",RAND(),IF(J12>L12,\"\",RAND()))","v":""},{"$f":"IF(H13=\"\",0,$E$3+H13*($F$3-$E$3))","v":0},{"$f":"IF(D13=\"Sim\",B13+I13,IF(J12>K12,J12,B13+I13))","v":6.2694678083408562},{"$f":"IF(B13<K12,K12,K12+$K$4)","v":6},3.9503583210980722,"Acidente",0,1,0,0,null,{"$f":"+S12+1","v":2},46.666666666666664,333.33333333333331,400,780]
[null,3.9503583210980722,"Acidente","Sim",0.77619045579350854,3.0402882742681028,6.9906465953661749,0.32243913502568788,2.9673174050770639,6.917675726175136,6,6,"Revisão",1,0,0,1,null,{"$f":"+S13+1","v":3},45.833333333333336,333.33333333333331,666.66666666666663,1045.8333333333333]
[null,6,"Revisão","Sim","","",6.9906465953661749,0.90818091624381081,4.724542748731432,10.724542748731432,9,6.9906465953661749,"Acidente",1,1,0,0,null,4,38.162539364806186,318.02116137338487,381.62539364806184,737.80909438625292]
[null,6.9906465953661749,"Acidente","Sim",0.10228640451582272,27.359742156478241,34.350388751844413,0.32474609674578736,2.9742382902373619,9.9648848856035368,9,9,"Revisão",1,0,0,1,null,5,48.148148148148145,333.33333333333331,518.51851851851848,900]
[null,9,"Revisão","Sim","","",34.350388751844413,0.37844544888292397,3.135336346648772,12.135336346648772,12,12,"Revisão",1,1,0,0,null,6,48.068524546908101,309.0119435158378,480.685245469081,837.76571353182692]
[null,12,"Revisão","Sim","","",34.350388751844413,0.16482557426655642,2.4944767227996691,14.49447672279967,15,14.49447672279967,{"$f":"IF(G18<(L18+0.09),\"Acidente\",IF(J18<K18,\"Avaria\",\"Revisão\"))","v":"Avaria"},1,1,0,0,null,7,37.037037037037038,296.2962962962963,592.59259259259261,925.92592592592598]
[null,{"$f":"+L18","v":14.49447672279967},{"$f":"+M18","v":"Avaria"},"Sim",{"$f":"IF(C19=\"Acidente\", RAND(),\"\")","v":""},{"$f":"IF(E19=\"\",\"\",-1/$E$4*LN(E19))","v":""},{"$f":"IF(F19=\"\",G18,+G18+F19)","v":34.350388751844413},{"$f":"IF(D19=\"Sim\",RAND(),IF(J18>L18,\"\",RAND()))","v":0.9035547252966023},4.7106641758898071,{"$f":"IF(D19=\"Sim\",B19+I19,IF(J18>K18,J18,B19+I19))","v":19.205140898689478},15,{"$f":"MIN(G19,J19,K19)","v":15},{"$f":"IF(G19<(L19+0.09),\"Acidente\",IF(J19<K19,\"Avaria\",\"Revisão\"))","v":"Revisão"},{"$f":"IF(D19=\"Sim\",1,0)","v":1},{"$f":"IF(C19=\"Revisão\",1,0)","v":0},{"$f":"IF(C19=\"Avaria\",1,0)","v":1},{"$f":"IF(C19=\"Acidente\",1,0)","v":0},null,8,36.666666666666664,333.33333333333331,400,770]
[null,15,"Revisão","Não","","",34.350388751844413,"",0,19.205140898689478,18,18,"Revisão",0,1,0,0,null,9,42.786531487834729,320.89898615876047,499.1762006914052,862.8617183380004]
[null,18,"Revisão","Sim","","",34.350388751844413,0.85977365051415522,4.5793209515424653,22.579320951542464,21,21,"Revisão",1,1,0,0,null,10,40.097466874075309,300.73100155556483,467.80378019754528,808.63224862718539]
[null,21,"Revisão","Sim","","",34.350388751844413,0.25936330488026438,2.7780899146407929,23.778089914640795,24,23.778089914640795,"Avaria",1,1,0,0,null,11,40,333.33333333333331,400,773.33333333333337]
[null,23.778089914640795,"Avaria","Sim","","",34.350388751844413,0.62801019438909556,3.8840305831672866,27.662120497808083,24,24,"Revisão",1,0,1,0,null,12,40.74074074074074,333.33333333333331,518.51851851851848,892.59259259259261]
[null,24,"Revisão","Não","","",34.350388751844413,"",0,27.662120497808083,27,27,"Revisão",0,1,0,0,null,13,41.666666666666664,333.33333333333331,222.22222222222223,597.22222222222217]
[null,27,"Revisão","Sim","","",34.350388751844413,0.81136155097840634,4.4340846529352191,31.434084652935219,30,30,"Revisão",1,1,0,0,null,14,46.274853624534053,308.49902416356036,616.99804832712073,971.77192611521514]
[null,30,"Revisão","Sim",{"$f":"IF(C26=\"Acidente\", RAND(),\"\")","v":""},"",34.350388751844413,0.71273637381013877,4.1382091214304157,34.138209121430414,33,33,{"$f":"IF(G26<(L26+0.09),\"Acidente\",IF(J26<K26,\"Avaria\",\"Revisão\"))","v":"Revisão"},1,1,0,0,null,15,43.333333333333336,333.33333333333331,400,776.66666666666663]
[null,null,null,null,"Total","Mês",null,null,null,null,null,null,null,{"$f":"SUM(N11:N26)","v":13},{"$f":"SUM(O11:O26)","v":10},{"$f":"SUM(P11:P26)","v":3},{"$f":"SUM(Q11:Q26)","v":3},null,16,43.29267324211596,309.23338030082829,371.08005636099392,723.6061099039382]
[null,"Custo das peças",null,null,{"$f":"N27*E5","v":1300},{"$f":"+E28/$B$26","v":43.333333333333336},null,"     Intervalo de Confiança a ",null,null,0.95,null,null,null,null,null,null,null,17,40.860107970463538,306.45080977847653,476.70125965540791,824.01217740434799]
[null,"Custo das revisões",null,null,{"$f":"+O27*E6","v":10000},{"$f":"+E29/$B$26","v":333.33333333333331},null,null,"Custos Mensais Totais",null,null,null,null,null,null,null,null,null,18,39.393939393939391,333.33333333333331,303.030303030303,675.75757575757575]
[null,"Custos De paragens",null,null,{"$f":"+E7*(P27+Q27)","v":12000},{"$f":"+E30/$B$26","v":400},null,null,null,null,null,null,null,null,null,null,null,null,19,44.444444444444443,333.33333333333331,518.51851851851848,896.2962962962963]
[null,"Custo Total",null,null,{"$f":"+E28+E29+E30","v":23300},{"$f":"+E31/$B$26","v":776.66666666666663},null,"Limite Inferior",null,null,"Limite Superior",null,null,null,null,null,null,null,20,45.833333333333336,333.33333333333331,666.66666666666663,1045.8333333333333]
[null,null,null,null,null,null,null,{"$f":"+$W$10-$W$9/SQRT($S$160+1)*TINV((1-$K$28)/2,$S$160)","v":826.1160656569192},null,null,{"$f":"+$W$10+$W$9/SQRT($S$160+1)*TINV((1-$K$28)/2,$S$160)","v":876.56488177525296},null,null,null,null,null,null,null,21,40,333.33333333333331,400,773.33333333333337]
[null,null,null,null,null,null,null,null,null,null,null,null,null,null,null,null,null,null,22,37.037037037037038,333.33333333333331,518.51851851851848,888.88888888888891]
[null,null,null,null,null,null,null,null,null,null,null,null,null,null,null,null,null,null,23,37.037037037037038,333.33333333333331,518.51851851851848,888.88888888888891]
[null,null,null,null,null,null,null,null,null,null,null,null,null,null,null,null,null,null,24,41.765914191614961,313.24435643711223,487.26899890217453,842.27926953090173]
[null,null,null,null,null,null,null,null,null,null,null,null,null,null,null,null,null,null,25,38.46153846153846,307.69230769230768,205.12820512820514,551.28205128205127]
[null,null,null,null,null,null,null,null,null,null,null,null,null,null,null,null,null,null,26,45.746886348580652,304.97924232387106,609.95848464774213,960.68461332019376]
[null,null,null,null,null,null,null,null,null,null,null,null,null,null,null,null,null,null,27,40,333.33333333333331,400,773.33333333333337]
[null,null,null,null,null,null,null,null,null,null,null,null,null,null,null,null,null,null,28,43.333333333333336,333.33333333333331,400,776.66666666666663]
[null,null,null,null,null,null,null,null,null,null,null,null,null,null,null,null,null,null,29,54.166666666666664,333.33333333333331,666.66666666666663,1054.1666666666667]
[null,null,null,null,null,null,null,null,null,null,null,null,null,null,null,null,null,null,30,44.444444444444443,333.33333333333331,518.51851851851848,896.2962962962963]
[null,null,null,null,null,null,null,null,null,null,null,null,null,null,null,null,null,null,31,40.105255659406232,300.78941744554675,467.89464935973939,808.78932246469242]
[null,null,null,null,null,null,null,null,null,null,null,null,null,null,null,null,null,null,32,46.666666666666664,333.33333333333331,400,780]
[null,null,null,null,null,null,null,null,null,null,null,null,null,null,null,null,null,null,33,43.333333333333336,333.33333333333331,400,776.66666666666663]
[null,null,null,null,null,null,null,null,null,null,null,null,null,null,null,null,null,null,34,40.555105995793497,304.16329496845123,473.1429032842575,817.86130424850217]
[null,null,null,null,null,null,null,null,null,null,null,null,null,null,null,null,null,null,35,39.429238911997004,303.30183778459235,363.96220534151081,706.69328203810016]
[null,null,null,null,null,null,null,null,null,null,null,null,null,null,null,null,null,null,36,40,333.33333333333331,400,773.33333333333337]
[null,null,null,null,null,null,null,null,null,null,null,null,null,null,null,null,null,null,37,44.955999113224003,299.70666075482671,599.41332150965343,944.07598137770412]
[null,null,null,null,null,null,null,null,null,null,null,null,null,null,null,null,null,null,38,40.454814076666544,330.99393335454448,514.87945188484696,886.32819931605798]
[null,null,null,null,null,null,null,null,null,null,null,null,null,null,null,null,null,null,39,54.166666666666664,333.33333333333331,666.66666666666663,1054.1666666666667]
[null,null,null,null,null,null,null,null,null,null,null,null,null,null,null,null,null,null,40,36.363636363636367,333.33333333333331,303.030303030303,672.72727272727275]
[null,null,null,null,null,null,null,null,null,null,null,null,null,null,null,null,null,null,41,42.013934551181052,294.09754185826739,756.25082192125899,1092.3622983307075]
[null,null,null,null,null,null,null,null,null,null,null,null,null,null,null,null,null,null,42,37.584137604180725,300.6731008334458,601.3462016668916,939.6034401045182]
[null,null,null,null,null,null,null,null,null,null,null,null,null,null,null,null,null,null,43,46.788310039118166,297.74379115802469,765.62689154920633,1110.1589927463492]
[null,null,null,null,null,null,null,null,null,null,null,null,null,null,null,null,null,null,44,63.413923342206566,292.67964619479955,975.59882064933186,1331.6923901863379]
[null,null,null,null,null,null,null,null,null,null,null,null,null,null,null,null,null,null,45,58.333333333333336,333.33333333333331,666.66666666666663,1058.3333333333333]
[null,null,null,null,null,null,null,null,null,null,null,null,null,null,null,null,null,null,46,40.74074074074074,333.33333333333331,518.51851851851848,892.59259259259261]
[null,null,null,null,null,null,null,null,null,null,null,null,null,null,null,null,null,null,47,43.333333333333336,333.33333333333331,400,776.66666666666663]
[null,null,null,null,null,null,null,null,null,null,null,null,null,null,null,null,null,null,48,41.03780427203391,298.45675834206475,596.91351668412949,936.40807929822824]
[null,null,null,null,null,null,null,null,null,null,null,null,null,null,null,null,null,null,49,40,333.33333333333331,400,773.33333333333337]
[null,null,null,null,null,null,null,null,null,null,null,null,null,null,null,null,null,null,50,40,333.33333333333331,400,773.33333333333337]
[null,null,null,null,null,null,null,null,null,null,null,null,null,null,null,null,null,null,51,51.851851851851855,296.2962962962963,592.59259259259261,940.74074074074076]
[null,null,null,null,null,null,null,null,null,null,null,null,null,null,null,null,null,null,52,44.444444444444443,333.33333333333331,518.51851851851848,896.2962962962963]
[null,null,null,null,null,null,null,null,null,null,null,null,null,null,null,null,null,null,53,37.295402260956024,310.79501884130019,372.95402260956024,721.04444371181648]
[null,null,null,null,null,null,null,null,null,null,null,null,null,null,null,null,null,null,54,37.037037037037038,333.33333333333331,518.51851851851848,888.88888888888891]
[null,null,null,null,null,null,null,null,null,null,null,null,null,null,null,null,null,null,55,37.561405238878692,313.01171032398912,375.61405238878694,726.18716795165471]
[null,null,null,null,null,null,null,null,null,null,null,null,null,null,null,null,null,null,56,39.393939393939391,333.33333333333331,303.030303030303,675.75757575757575]
[null,null,null,null,null,null,null,null,null,null,null,null,null,null,null,null,null,null,57,36.363636363636367,333.33333333333331,303.030303030303,672.72727272727275]
[null,null,null,null,null,null,null,null,null,null,null,null,null,null,null,null,null,null,58,50,333.33333333333331,666.66666666666663,1050]
[null,null,null,null,null,null,null,null,null,null,null,null,null,null,null,null,null,null,59,37.037037037037038,333.33333333333331,518.51851851851848,888.88888888888891]
[null,null,null,null,null,null,null,null,null,null,null,null,null,null,null,null,null,null,60,44.444444444444443,333.33333333333331,518.51851851851848,896.2962962962963]
[null,null,null,null,null,null,null,null,null,null,null,null,null,null,null,null,null,null,61,48.148148148148145,333.33333333333331,518.51851851851848,900]
[null,null,null,null,null,null,null,null,null,null,null,null,null,null,null,null,null,null,62,44.850398784292366,310.50276081433179,483.00429460007166,838.35745419869579]
[null,null,null,null,null,null,null,null,null,null,null,null,null,null,null,null,null,null,63,36.363636363636367,333.33333333333331,303.030303030303,672.72727272727275]
[null,null,null,null,null,null,null,null,null,null,null,null,null,null,null,null,null,null,64,37.037037037037038,333.33333333333331,518.51851851851848,888.88888888888891]
[null,null,null,null,null,null,null,null,null,null,null,null,null,null,null,null,null,null,65,48.148148148148145,333.33333333333331,518.51851851851848,900]
[null,null,null,null,null,null,null,null,null,null,null,null,null,null,null,null,null,null,66,40.21047268126518,309.31132831742445,371.17359398090935,720.69539497959897]
[null,null,null,null,null,null,null,null,null,null,null,null,null,null,null,null,null,null,{"$f":"+S77+1","v":67},52.38095238095238,333.33333333333331,857.14285714285711,1242.8571428571429]
[null,null,null,null,null,null,null,null,null,null,null,null,null,null,null,null,null,null,68,36.788456294077278,300.99646058790501,468.21671647007446,806.00163335205673]
[null,null,null,null,null,null,null,null,null,null,null,null,null,null,null,null,null,null,69,55.555555555555557,333.33333333333331,518.51851851851848,907.40740740740739]
[null,null,null,null,null,null,null,null,null,null,null,null,null,null,null,null,null,null,70,36.666666666666664,333.33333333333331,400,770]
[null,null,null,null,null,null,null,null,null,null,null,null,null,null,null,null,null,null,71,40,333.33333333333331,400,773.33333333333337]
[null,null,null,null,null,null,null,null,null,null,null,null,null,null,null,null,null,null,72,43.4806060559117,304.36424239138188,782.65090900641053,1130.4957574537041]
[null,null,null,null,null,null,null,null,null,null,null,null,null,null,null,null,null,null,73,50,333.33333333333331,666.66666666666663,1050]
[null,null,null,null,null,null,null,null,null,null,null,null,null,null,null,null,null,null,74,51.851851851851855,333.33333333333331,518.51851851851848,903.7037037037037]
[null,null,null,null,null,null,null,null,null,null,null,null,null,null,null,null,null,null,75,37.33490410478899,305.46739722100085,475.17150678822355,817.97380811401331]
[null,null,null,null,null,null,null,null,null,null,null,null,null,null,null,null,null,null,76,40.74074074074074,333.33333333333331,518.51851851851848,892.59259259259261]
[null,null,null,null,null,null,null,null,null,null,null,null,null,null,null,null,null,null,77,44.444444444444443,333.33333333333331,518.51851851851848,896.2962962962963]
[null,null,null,null,null,null,null,null,null,null,null,null,null,null,null,null,null,null,78,44.130687640990509,305.52014520685736,475.25355921066705,824.90439205851499]
[null,null,null,null,null,null,null,null,null,null,null,null,null,null,null,null,null,null,79,39.393939393939391,333.33333333333331,303.030303030303,675.75757575757575]
[null,null,null,null,null,null,null,null,null,null,null,null,null,null,null,null,null,null,80,40,333.33333333333331,400,773.33333333333337]
[null,null,null,null,null,null,null,null,null,null,null,null,null,null,null,null,null,null,81,36.666666666666664,333.33333333333331,400,770]
[null,null,null,null,null,null,null,null,null,null,null,null,null,null,null,null,null,null,82,37.00139246167668,317.15479252865725,211.43652835243816,565.59271334277207]
[null,null,null,null,null,null,null,null,null,null,null,null,null,null,null,null,null,null,83,48.148148148148145,333.33333333333331,518.51851851851848,900]
[null,null,null,null,null,null,null,null,null,null,null,null,null,null,null,null,null,null,84,43.170238260386277,308.35884471704486,370.03061366045381,721.55969663788494]
[null,null,null,null,null,null,null,null,null,null,null,null,null,null,null,null,null,null,85,42.424242424242422,333.33333333333331,303.030303030303,678.78787878787875]
[null,null,null,null,null,null,null,null,null,null,null,null,null,null,null,null,null,null,86,44.590797191647454,297.27198127764973,594.54396255529946,936.40674102459661]
[null,null,null,null,null,null,null,null,null,null,null,null,null,null,null,null,null,null,87,45.833333333333336,333.33333333333331,666.66666666666663,1045.8333333333333]
[null,null,null,null,null,null,null,null,null,null,null,null,null,null,null,null,null,null,88,40.74074074074074,296.2962962962963,592.59259259259261,929.62962962962968]
[null,null,null,null,null,null,null,null,null,null,null,null,null,null,null,null,null,null,89,40,333.33333333333331,400,773.33333333333337]
[null,null,null,null,null,null,null,null,null,null,null,null,null,null,null,null,null,null,90,48.374844871901246,260.47993392562211,669.80554438017111,978.66032317769452]
[null,null,null,null,null,null,null,null,null,null,null,null,null,null,null,null,null,null,91,37.037037037037038,333.33333333333331,518.51851851851848,888.88888888888891]
[null,null,null,null,null,null,null,null,null,null,null,null,null,null,null,null,null,null,92,43.149050573387541,308.20750409562532,369.84900491475037,721.20555958376326]
[null,null,null,null,null,null,null,null,null,null,null,null,null,null,null,null,null,null,93,43.421171294890947,315.79033669011596,631.58067338023193,990.79218136523889]
[null,null,null,null,null,null,null,null,null,null,null,null,null,null,null,null,null,null,94,44.031197212794247,304.83136531934474,474.18212383009188,823.04468636223089]
[null,null,null,null,null,null,null,null,null,null,null,null,null,null,null,null,null,null,95,40.74074074074074,333.33333333333331,518.51851851851848,892.59259259259261]
[null,null,null,null,null,null,null,null,null,null,null,null,null,null,null,null,null,null,96,42.424242424242422,333.33333333333331,303.030303030303,678.78787878787875]
[null,null,null,null,null,null,null,null,null,null,null,null,null,null,null,null,null,null,97,40.74074074074074,333.33333333333331,518.51851851851848,892.59259259259261]
[null,null,null,null,null,null,null,null,null,null,null,null,null,null,null,null,null,null,98,38.888888888888886,333.33333333333331,222.22222222222223,594.44444444444446]
[null,null,null,null,null,null,null,null,null,null,null,null,null,null,null,null,null,null,99,44.444444444444443,333.33333333333331,518.51851851851848,896.2962962962963]
[null,null,null,null,null,null,null,null,null,null,null,null,null,null,null,null,null,null,100,40.74074074074074,333.33333333333331,518.51851851851848,892.59259259259261]
[null,null,null,null,null,null,null,null,null,null,null,null,null,null,null,null,null,null,101,44.444444444444443,333.33333333333331,518.51851851851848,896.2962962962963]
[null,null,null,null,null,null,null,null,null,null,null,null,null,null,null,null,null,null,102,39.393939393939391,333.33333333333331,303.030303030303,675.75757575757575]
[null,null,null,null,null,null,null,null,null,null,null,null,null,null,null,null,null,null,103,44.444444444444443,296.2962962962963,592.59259259259261,933.33333333333337]
[null,null,null,null,null,null,null,null,null,null,null,null,null,null,null,null,null,null,104,49.400448611926393,304.00276068877781,608.00552137755562,961.40873067825987]
[null,null,null,null,null,null,null,null,null,null,null,null,null,null,null,null,null,null,105,41.162650242253719,308.71987681690291,480.23091949296008,830.11344655211667]
[null,null,null,null,null,null,null,null,null,null,null,null,null,null,null,null,null,null,106,41.666666666666664,333.33333333333331,222.22222222222223,597.22222222222217]
[null,null,null,null,null,null,null,null,null,null,null,null,null,null,null,null,null,null,107,42.094883476648207,315.71162607486156,491.10697389422904,848.91348344573885]
[null,null,null,null,null,null,null,null,null,null,null,null,null,null,null,null,null,null,108,40.74074074074074,333.33333333333331,518.51851851851848,892.59259259259261]
[null,null,null,null,null,null,null,null,null,null,null,null,null,null,null,null,null,null,109,41.308746642594201,300.42724830977602,600.85449661955204,942.59049157192226]
[null,null,null,null,null,null,null,null,null,null,null,null,null,null,null,null,null,null,110,40.74074074074074,333.33333333333331,518.51851851851848,892.59259259259261]
[null,null,null,null,null,null,null,null,null,null,null,null,null,null,null,null,null,null,111,48.148148148148145,333.33333333333331,518.51851851851848,900]
[null,null,null,null,null,null,null,null,null,null,null,null,null,null,null,null,null,null,112,40.30956654763412,302.32174910725587,470.27827638906473,812.90959204395472]
[null,null,null,null,null,null,null,null,null,null,null,null,null,null,null,null,null,null,113,48.148148148148145,333.33333333333331,518.51851851851848,900]
[null,null,null,null,null,null,null,null,null,null,null,null,null,null,null,null,null,null,114,36.666666666666664,333.33333333333331,400,770]
[null,null,null,null,null,null,null,null,null,null,null,null,null,null,null,null,null,null,115,45.833333333333336,333.33333333333331,666.66666666666663,1045.8333333333333]
[null,null,null,null,null,null,null,null,null,null,null,null,null,null,null,null,null,null,116,43.884184037359837,329.13138028019881,511.98214710253143,884.99771142009001]
[null,null,null,null,null,null,null,null,null,null,null,null,null,null,null,null,null,null,117,54.166666666666664,333.33333333333331,666.66666666666663,1054.1666666666667]
[null,null,null,null,null,null,null,null,null,null,null,null,null,null,null,null,null,null,118,38.888888888888886,333.33333333333331,222.22222222222223,594.44444444444446]
[null,null,null,null,null,null,null,null,null,null,null,null,null,null,null,null,null,null,119,36.363636363636367,333.33333333333331,303.030303030303,672.72727272727275]
[null,null,null,null,null,null,null,null,null,null,null,null,null,null,null,null,null,null,120,36.666666666666664,300,466.66666666666669,803.33333333333337]
[null,null,null,null,null,null,null,null,null,null,null,null,null,null,null,null,null,null,121,49.626746006287078,305.39536003868972,610.79072007737943,965.81282612235623]
[null,null,null,null,null,null,null,null,null,null,null,null,null,null,null,null,null,null,122,44.444444444444443,333.33333333333331,518.51851851851848,896.2962962962963]
[null,null,null,null,null,null,null,null,null,null,null,null,null,null,null,null,null,null,123,37.275258966513107,304.97939154419817,474.41238684653047,816.66703735724172]
[null,null,null,null,null,null,null,null,null,null,null,null,null,null,null,null,null,null,124,45.453124474435747,314.675477130709,489.49518664776957,849.62378825291432]
[null,null,null,null,null,null,null,null,null,null,null,null,null,null,null,null,null,null,125,40.951652347321989,327.61321877857591,655.22643755715183,1023.7913086830497]
[null,null,null,null,null,null,null,null,null,null,null,null,null,null,null,null,null,null,126,36.666666666666664,333.33333333333331,400,770]
[null,null,null,null,null,null,null,null,null,null,null,null,null,null,null,null,null,null,127,44.185104595922731,331.38828446942046,515.49288695243183,891.06627601777507]
[null,null,null,null,null,null,null,null,null,null,null,null,null,null,null,null,null,null,128,51.851851851851855,333.33333333333331,518.51851851851848,903.7037037037037]
[null,null,null,null,null,null,null,null,null,null,null,null,null,null,null,null,null,null,129,43.333333333333336,333.33333333333331,400,776.66666666666663]
[null,null,null,null,null,null,null,null,null,null,null,null,null,null,null,null,null,null,130,39.393939393939391,333.33333333333331,303.030303030303,675.75757575757575]
[null,null,null,null,null,null,null,null,null,null,null,null,null,null,null,null,null,null,{"$f":"+S141+1","v":131},41.73966340396499,288.96690048898841,449.50406742731531,780.2106313202687]
[null,null,null,null,null,null,null,null,null,null,null,null,null,null,null,null,null,null,132,43.20493885491711,308.6067061065508,370.32804732786099,722.13969228932888]
[null,null,null,null,null,null,null,null,null,null,null,null,null,null,null,null,null,null,133,44.444444444444443,333.33333333333331,518.51851851851848,896.2962962962963]
[null,null,null,null,null,null,null,null,null,null,null,null,null,null,null,null,null,null,134,44.444444444444443,333.33333333333331,518.51851851851848,896.2962962962963]
[null,null,null,null,null,null,null,null,null,null,null,null,null,null,null,null,null,null,135,48.760948873802853,325.07299249201901,650.14598498403802,1023.97992634986]
[null,null,null,null,null,null,null,null,null,null,null,null,null,null,null,null,null,null,136,38.35256923298742,306.82055386389936,613.64110772779873,958.81423082468564]
[null,null,null,null,null,null,null,null,null,null,null,null,null,null,null,null,null,null,137,39.914471764592058,307.03439818916968,368.4412778270036,715.39014778076535]
[null,null,null,null,null,null,null,null,null,null,null,null,null,null,null,null,null,null,138,43.333333333333336,333.33333333333331,400,776.66666666666663]
[null,null,null,null,null,null,null,null,null,null,null,null,null,null,null,null,null,null,139,39.873460260906789,318.98768208725431,637.97536417450863,996.83650652266977]
[null,null,null,null,null,null,null,null,null,null,null,null,null,null,null,null,null,null,140,38.888888888888886,333.33333333333331,222.22222222222223,594.44444444444446]
[null,null,null,null,null,null,null,null,null,null,null,null,null,null,null,null,null,null,141,37.585770172276121,313.21475143563435,375.85770172276119,726.65822333067172]
[null,null,null,null,null,null,null,null,null,null,null,null,null,null,null,null,null,null,142,36.666666666666664,333.33333333333331,400,770]
[null,null,null,null,null,null,null,null,null,null,null,null,null,null,null,null,null,null,143,40.74074074074074,333.33333333333331,518.51851851851848,892.59259259259261]
[null,null,null,null,null,null,null,null,null,null,null,null,null,null,null,null,null,null,144,40.74074074074074,333.33333333333331,518.51851851851848,892.59259259259261]
[null,null,null,null,null,null,null,null,null,null,null,null,null,null,null,null,null,null,145,40,333.33333333333331,400,773.33333333333337]
[null,null,null,null,null,null,null,null,null,null,null,null,null,null,null,null,null,null,146,40,333.33333333333331,400,773.33333333333337]
[null,null,null,null,null,null,null,null,null,null,null,null,null,null,null,null,null,null,147,43.333333333333336,333.33333333333331,400,776.66666666666663]
[null,null,null,null,null,null,null,null,null,null,null,null,null,null,null,null,null,null,148,41.348598026081262,330.7887842086501,661.5775684173002,1033.7149506520316]
[null,null,null,null,null,null,null,null,null,null,null,null,null,null,null,null,null,null,149,61.904761904761905,285.71428571428572,952.38095238095241,1300]

{"sheet":"Sheet2","index":1,"n_rows":0,"n_cols":0,"rows_kept":0,"cut":false,"hidden":false,"merged":[]}

{"sheet":"Sheet3","index":2,"n_rows":0,"n_cols":0,"rows_kept":0,"cut":false,"hidden":false,"merged":[]}